{"text_format":"1","workbook":"xlsx","n_sheets":8,"sheets":["Introduction","Savings&Service Classifications","savings_tables","Summary","Summary2","Charts","Classification_codes","Budget Estimate 2018-19"],"not_rendered":{"charts":28,"images":0,"macros":1,"external_links":0,"defined_names":3,"comments":0,"pivot_tables":2},"unopened":[],"bounds":{"document_bytes":16777216,"sheet_cells":100000,"rows_first":2000,"rows_last":500,"rows_between":2000,"halvings":0,"cell_chars":16384,"cell_head_chars":4096},"cells_cut":0,"cells_raw":0,"read":"whole","date_system":"1900"}

{"sheet":"Introduction","index":0,"n_rows":33,"n_cols":2,"rows_kept":33,"cut":false,"hidden":false,"merged":[[26,0,26,11],[28,0,28,11],[30,0,30,11],[32,0,32,11],[1,0,1,11],[18,0,18,11],[19,0,19,11],[21,0,21,11],[4,0,4,11],[16,0,16,11]]}
["Introduction"]
["This workbook has been developed from the techniques used in JRF research report ‘The Cost of the Cuts: The Impact on Local Government and Poorer Communities’. This research sought to explore the impact of cuts to council expenditure on council services and the people that rely on them. The aim of this work book is to give councils a picture of the social impact of their plans that will aid discussion between colleagues across different roles such as policy, strategy, research and finance.\nThe main element of this work book is a classification of specific council services according to which social groups tend to use which services more or less. This 'Standard' classification allows councils to assess each of their savings proposals in terms of whether they fall on a service which is 'pro-poor', 'pro-rich' or ‘neutral’ in terms of its use and benefit. (The 'How to' guide which accompanies this work book gives more detail on how this classification was derived).  We have also provided space in the work book for you to classify services in ways which reflect local views about patterns of use and benefit (the 'Alternative' classification). We do suggest that you start the process using the 'Standard' classification before experimenting with alternatives. \nBefore you get started on using the work book, you will need to have detailed information on how much your council plans to save on specific services for a given year. And you will need to have this information organised by the heading used  as part of the Scottish Local Government Finance Statistics expenditure analysis. A finance officer should be able to provide this for you. The workbook has been set up with the data necessary to allow you to see how these savings relate to overall expenditure on a given service, as well as how savings impact on services on the pro-poor, neutral and pro-rich spectrum.  The expenditure data is the SLGF Service Analysis of Budget Estimates 2018/19.\n"]
[]
["About this workbook:"]
["Savings & Service Classification: This sheet lists all services by SLGF sub-heading. Each service sub-heading has been allocated one of seven categories based on the Standard service classification (see table below). This is the page where you enter savings for each service. It also contains the Standard classfication for each service and space for you to enter an Alternative classification if you want. "]
[]
{"$rows_left_out":28}
{"sheet":"Savings&Service Classifications","index":1,"n_rows":88,"n_cols":8,"rows_kept":88,"cut":false,"hidden":false,"merged":[]}
[null,null,null,"STANDARD CLASSIFICATION",null,"ALTERNATIVE CLASSIFICATION"]
["No","Service Heading","Service","Code","Pattern of use/ benefit","Code","Pattern of use/ benefit","Savings (£'000)"]
[1,"Education","Pre-primary education",0,{"$f":"VLOOKUP(D3,Classification_codes!$A$6:$B$13,2,0)","v":"Neutral"},0,{"$f":"IF(ISBLANK(F3),\"unclassified\",(VLOOKUP(F3,Classification_codes!$A$6:$B$13,2,0)))","v":"Neutral"}]
[2,"Education","Primary education",2,{"$f":"VLOOKUP(D4,Classification_codes!$A$6:$B$13,2,0)","v":"Pro-Poor"},2,{"$f":"IF(ISBLANK(F4),\"unclassified\",(VLOOKUP(F4,Classification_codes!$A$6:$B$13,2,0)))","v":"Pro-Poor"}]
[3,"Education","Secondary education",1,{"$f":"VLOOKUP(D5,Classification_codes!$A$6:$B$13,2,0)","v":"Neutral-Plus"},1,{"$f":"IF(ISBLANK(F5),\"unclassified\",(VLOOKUP(F5,Classification_codes!$A$6:$B$13,2,0)))","v":"Neutral-Plus"}]
[4,"Education","Special education",2,{"$f":"VLOOKUP(D6,Classification_codes!$A$6:$B$13,2,0)","v":"Pro-Poor"},2,{"$f":"IF(ISBLANK(F6),\"unclassified\",(VLOOKUP(F6,Classification_codes!$A$6:$B$13,2,0)))","v":"Pro-Poor"}]
{"$rows_left_out":83}
{"sheet":"savings_tables","index":2,"n_rows":26,"n_cols":2,"rows_kept":26,"cut":false,"hidden":false,"merged":[]}
[]
[]
["Row Labels","Sum of Savings (£'000)"]
[-2]
[-1]
[0]
{"$rows_left_out":21}
{"sheet":"Summary","index":3,"n_rows":30,"n_cols":9,"rows_kept":30,"cut":false,"hidden":false,"merged":[[19,1,19,2],[6,1,6,2]]}
[]
[]
["Local Authority","Population"]
["Aberdeen City",{"$f":"VLOOKUP($A$4, 'Budget Estimate 2018-19'!$A$1:$CG$37,2,FALSE)","v":229840}]
[]
[]
{"$rows_left_out":25}
{"sheet":"Summary2","index":4,"n_rows":27,"n_cols":9,"rows_kept":27,"cut":false,"hidden":false,"merged":[[19,1,19,2]]}
[]
[null,"STANDARD CLASSIFICATION"]
[null,"Pattern of use","Expenditure (£'000)","Expenditure (%)","Expenditure per capita","Savings (£'000)","Savings (%)","Savings per capita","Savings as % of expenditure"]
[null,"Pro-Rich",{"$f":"Summary!C9","v":17413},{"$f":"C4/C9","v":3.7944424590549738E-2},{"$f":"(C4*1000)/Summary!B4","v":75.761399234249907},{"$f":"Summary!F9","v":0},{"$f":"F4/F9","v":{"$error":"#DIV/0!"}},{"$f":"F4/(Summary!B4/1000)","v":0},{"$f":"F4/C4","v":0}]
[null,"Neutral",{"$f":"SUM(Summary!C10:C12)","v":151347},{"$f":"C5/C9","v":0.32979812947257403},{"$f":"(C5*1000)/Summary!B4","v":658.4885137486948},{"$f":"SUM(Summary!F10:F12)","v":0},{"$f":"F5/F9","v":{"$error":"#DIV/0!"}},{"$f":"F5/(Summary!B4/1000)","v":0},{"$f":"F5/C5","v":0}]
[null,"Pro-Poor",{"$f":"SUM(Summary!C13:C14)","v":250643},{"$f":"C6/C9","v":0.54617265334228216},{"$f":"(C6*1000)/Summary!B4","v":1090.5107901148624},{"$f":"SUM(Summary!F13:F14)","v":0},{"$f":"F6/F9","v":{"$error":"#DIV/0!"}},{"$f":"F6/(Summary!B4/1000)","v":0},{"$f":"F6/C6","v":0}]
{"$rows_left_out":22}
{"sheet":"Charts","index":5,"n_rows":188,"n_cols":1,"rows_kept":188,"cut":false,"hidden":false,"merged":[]}
["STANDARD CLASSIFICATION CHARTS"]
[]
[]
[]
[]
[]
{"$rows_left_out":183}
{"sheet":"Classification_codes","index":6,"n_rows":13,"n_cols":2,"rows_kept":13,"cut":false,"hidden":true,"merged":[]}
[]
[]
[]
[]
["Code","Pattern of use/benefit"]
[-2,"Pro-Rich"]
{"$rows_left_out":8}
{"sheet":"Budget Estimate 2018-19","index":7,"n_rows":37,"n_cols":127,"rows_kept":37,"cut":false,"hidden":true,"merged":[]}
[null,null,"Education",null,null,null,null,null,"Cultural and related services",null,null,null,null,null,null,null,null,"Social work",null,null,null,null,null,null,null,null,"Roads and transport",null,null,null,null,null,null,null,null,null,null,null,"Environmental services",null,null,null,null,null,null,null,null,"Planning and economic development",null,null,null,null,"Non-HRA Housing",null,null,null,null,null,null,null,null,null,"Central services",null,null,null,null,null,null,null,null,null,null,null,null,null,null,null,null,null,null,null,null,null,null,null,null,null,null,null,"Standard Classification - Summary",null,null,null,null,null,null,null,null,null,"Standard Classification - Percentage",null,null,null,null,null,null,null,null,"Alternative Classification - Summary",null,null,null,null,null,null,null,null,null,"Alternative Classification - Percentage"]
[null,"Population","Pre-primary education","Primary education","Secondary education","Special education","Community Learning","Other non-school funding","Museums and galleries","Other cultural and heritage services","Promotional events","Other tourism","Countryside recreation and management","Sport facilities","Community parks and open spaces","Other recreation and sport","Library Service","Service Strategy","Children's Panel","Children and families","Older persons","Adults with physical or sensory disabilities","Adults with learning disabilities","Adults with mental health needs","Adults with other needs","Criminal justice social work services","Road construction","Winter maintenance","Maintenance & repairs","Road lighting","School crossing patrols","Road Safety and Traffic Calming","Other network and traffic management ","Parking","Local authority public transport ","Non-LA public transport: Concessionary fares","Non-LA public transport: Support to operators and voluntary groups","Non-LA public transport: Co-ordination","Trading Standards - Citizens Advice","Tradind Standards - Other (Consumer Protection)","Waste Management - Waste Collection","Waste Management - Waste Disposal","Waste Management - Other","Other - Cemetery, cremation and mortuary services","Other -  Coast Protection","Other - Flood defence and land drainage","Other - Environmental Health","Planning: Building control","Planning: Development control","Planning: Policy","Planning: Environmental initiatives","Economic development","Administration of Housing Advances","Renovation and Improvement Grants (excl admin costs)","Administration of Renovation and Improvement Grants","Other Private Sector Housing Renewal","Housing Benefits: Rent Allowance","Housing Benefits: Rent Rebate","Homelessness","Housing Support Services","Welfare Services","Other non-HRA Housing (excl. admin of Housing Benefits)","Council Tax Collection ","Non-Domestic Rates Collection","Administration of Council Tax Reduction & Housing Benefit","Emergency Planning","Licensing","Conducting Elections","Registration of Electors","Non-Domestic Lands Valuation","Council Tax Valuation","Non-Road Lighting","General Grants, Bequests & Donations","Registration of Births, Deaths & Marriages","Corporate and Democratic Core","Equal Pay/Single Status (prior year cost/provision only)","Non Distributed Costs","Miscellaneous","Surplus(-)/Deficit(+) on trading operations not already included ","Capital expenditure charged to the General Fund","Interest and Investment income (record a credit as a negative value)","Statutory repayment of debt - Loans fund","Statutory repayment of debt - Credit arrangements (Finance leases / PPP/PFI)","Interest payable and similar charges","Premiums and discounts","Debt Management Expenses","Contingency","All services",null,null,"Pro-Rich","Neutral-Minus","Neutral","Neutral-Plus","Pro-Poor","Very Pro-Poor","Back Office","Unclassified","TOTAL_EXP",null,"Pro-Rich","Neutral-Minus","Neutral","Neutral-Plus","Pro-Poor","Very Pro-Poor","Back Office","Unclassified",null,"Pro-Rich","Neutral-Minus","Neutral","Neutral-Plus","Pro-Poor","Very Pro-Poor","Back Office","Unclassified","TOTAL_EXP",null,"Pro-Rich","Neutral-Minus","Neutral","Neutral-Plus","Pro-Poor","Very Pro-Poor","Back Office","Unclassified"]
["Standard Classification",null,{"$f":"'Savings&Service Classifications'!D3","v":0},{"$f":"'Savings&Service Classifications'!D4","v":2},{"$f":"'Savings&Service Classifications'!D5","v":1},{"$f":"'Savings&Service Classifications'!D6","v":2},{"$f":"'Savings&Service Classifications'!D7","v":-2},{"$f":"'Savings&Service Classifications'!D8","v":1},{"$f":"'Savings&Service Classifications'!D9","v":-2},{"$f":"'Savings&Service Classifications'!D10","v":-2},{"$f":"'Savings&Service Classifications'!D11","v":-1},{"$f":"'Savings&Service Classifications'!D12","v":-1},{"$f":"'Savings&Service Classifications'!D13","v":-1},{"$f":"'Savings&Service Classifications'!D14","v":-1},{"$f":"'Savings&Service Classifications'!D15","v":-1},{"$f":"'Savings&Service Classifications'!D16","v":-1},{"$f":"'Savings&Service Classifications'!D17","v":1},{"$f":"'Savings&Service Classifications'!D18","v":2},{"$f":"'Savings&Service Classifications'!D19","v":3},{"$f":"'Savings&Service Classifications'!D20","v":3},{"$f":"'Savings&Service Classifications'!D21","v":2},{"$f":"'Savings&Service Classifications'!D22","v":2},{"$f":"'Savings&Service Classifications'!D23","v":2},{"$f":"'Savings&Service Classifications'!D24","v":2},{"$f":"'Savings&Service Classifications'!D25","v":2},{"$f":"'Savings&Service Classifications'!D26","v":2},{"$f":"'Savings&Service Classifications'!D27","v":-1},{"$f":"'Savings&Service Classifications'!D28","v":-1},{"$f":"'Savings&Service Classifications'!D29","v":-1},{"$f":"'Savings&Service Classifications'!D30","v":-1},{"$f":"'Savings&Service Classifications'!D31","v":-1},{"$f":"'Savings&Service Classifications'!D32","v":-1},{"$f":"'Savings&Service Classifications'!D33","v":-1},{"$f":"'Savings&Service Classifications'!D34","v":-2},{"$f":"'Savings&Service Classifications'!D35","v":2},{"$f":"'Savings&Service Classifications'!D36","v":2},{"$f":"'Savings&Service Classifications'!D37","v":2},{"$f":"'Savings&Service Classifications'!D38","v":99},{"$f":"'Savings&Service Classifications'!D39","v":3},{"$f":"'Savings&Service Classifications'!D40","v":0},{"$f":"'Savings&Service Classifications'!D41","v":0},{"$f":"'Savings&Service Classifications'!D42","v":0},{"$f":"'Savings&Service Classifications'!D43","v":0},{"$f":"'Savings&Service Classifications'!D44","v":0},{"$f":"'Savings&Service Classifications'!D45","v":0},{"$f":"'Savings&Service Classifications'!D46","v":0},{"$f":"'Savings&Service Classifications'!D47","v":0},{"$f":"'Savings&Service Classifications'!D48","v":-2},{"$f":"'Savings&Service Classifications'!D49","v":-2},{"$f":"'Savings&Service Classifications'!D50","v":-2},{"$f":"'Savings&Service Classifications'!D51","v":0},{"$f":"'Savings&Service Classifications'!D52","v":0},{"$f":"'Savings&Service Classifications'!D53","v":3},{"$f":"'Savings&Service Classifications'!D54","v":3},{"$f":"'Savings&Service Classifications'!D55","v":3},{"$f":"'Savings&Service Classifications'!D56","v":3},{"$f":"'Savings&Service Classifications'!D57","v":3},{"$f":"'Savings&Service Classifications'!D58","v":3},{"$f":"'Savings&Service Classifications'!D59","v":3},{"$f":"'Savings&Service Classifications'!D60","v":3},{"$f":"'Savings&Service Classifications'!D61","v":3},{"$f":"'Savings&Service Classifications'!D62","v":3},{"$f":"'Savings&Service Classifications'!D63","v":99},{"$f":"'Savings&Service Classifications'!D64","v":99},{"$f":"'Savings&Service Classifications'!D65","v":3},{"$f":"'Savings&Service Classifications'!D66","v":0},{"$f":"'Savings&Service Classifications'!D67","v":0},{"$f":"'Savings&Service Classifications'!D68","v":0},{"$f":"'Savings&Service Classifications'!D69","v":0},{"$f":"'Savings&Service Classifications'!D70","v":99},{"$f":"'Savings&Service Classifications'!D71","v":99},{"$f":"'Savings&Service Classifications'!D73","v":-1},{"$f":"'Savings&Service Classifications'!D74","v":2},{"$f":"'Savings&Service Classifications'!D75","v":0},{"$f":"'Savings&Service Classifications'!D76","v":99},{"$f":"'Savings&Service Classifications'!D77","v":99},{"$f":"'Savings&Service Classifications'!D78","v":99},{"$f":"'Savings&Service Classifications'!D79","v":99},{"$f":"'Savings&Service Classifications'!D80","v":100},{"$f":"'Savings&Service Classifications'!D81","v":100},{"$f":"'Savings&Service Classifications'!D82","v":100},{"$f":"'Savings&Service Classifications'!D83","v":100},{"$f":"'Savings&Service Classifications'!D84","v":100},{"$f":"'Savings&Service Classifications'!D85","v":100},{"$f":"'Savings&Service Classifications'!D86","v":100},{"$f":"'Savings&Service Classifications'!D87","v":100},{"$f":"'Savings&Service Classifications'!D88","v":100}]
["Alternative Classification",null,{"$f":"'Savings&Service Classifications'!F3","v":0},{"$f":"'Savings&Service Classifications'!F4","v":2},{"$f":"'Savings&Service Classifications'!F5","v":1},{"$f":"'Savings&Service Classifications'!F6","v":2},{"$f":"'Savings&Service Classifications'!F7","v":-2},{"$f":"'Savings&Service Classifications'!F8","v":1},{"$f":"'Savings&Service Classifications'!F9","v":-2},{"$f":"'Savings&Service Classifications'!F10","v":-2},{"$f":"'Savings&Service Classifications'!F11","v":-1},{"$f":"'Savings&Service Classifications'!F12","v":-1},{"$f":"'Savings&Service Classifications'!F13","v":-1},{"$f":"'Savings&Service Classifications'!F14","v":-1},{"$f":"'Savings&Service Classifications'!F15","v":-1},{"$f":"'Savings&Service Classifications'!F16","v":-1},{"$f":"'Savings&Service Classifications'!F17","v":1},{"$f":"'Savings&Service Classifications'!F18","v":2},{"$f":"'Savings&Service Classifications'!F19","v":3},{"$f":"'Savings&Service Classifications'!F20","v":3},{"$f":"'Savings&Service Classifications'!F21","v":2},{"$f":"'Savings&Service Classifications'!F22","v":2},{"$f":"'Savings&Service Classifications'!F23","v":2},{"$f":"'Savings&Service Classifications'!F24","v":2},{"$f":"'Savings&Service Classifications'!F25","v":2},{"$f":"'Savings&Service Classifications'!F26","v":2},{"$f":"'Savings&Service Classifications'!F27","v":-1},{"$f":"'Savings&Service Classifications'!F28","v":-1},{"$f":"'Savings&Service Classifications'!F29","v":-1},{"$f":"'Savings&Service Classifications'!F30","v":-1},{"$f":"'Savings&Service Classifications'!F31","v":-1},{"$f":"'Savings&Service Classifications'!F32","v":-1},{"$f":"'Savings&Service Classifications'!F33","v":-1},{"$f":"'Savings&Service Classifications'!F34","v":-2},{"$f":"'Savings&Service Classifications'!F35","v":2},{"$f":"'Savings&Service Classifications'!F36","v":2},{"$f":"'Savings&Service Classifications'!F37","v":2},{"$f":"'Savings&Service Classifications'!F38","v":99},{"$f":"'Savings&Service Classifications'!F39","v":3},{"$f":"'Savings&Service Classifications'!F40","v":0},{"$f":"'Savings&Service Classifications'!F41","v":0},{"$f":"'Savings&Service Classifications'!F42","v":0},{"$f":"'Savings&Service Classifications'!F43","v":0},{"$f":"'Savings&Service Classifications'!F44","v":0},{"$f":"'Savings&Service Classifications'!F45","v":0},{"$f":"'Savings&Service Classifications'!F46","v":0},{"$f":"'Savings&Service Classifications'!F47","v":0},{"$f":"'Savings&Service Classifications'!F48","v":-2},{"$f":"'Savings&Service Classifications'!F49","v":-2},{"$f":"'Savings&Service Classifications'!F50","v":-2},{"$f":"'Savings&Service Classifications'!F51","v":0},{"$f":"'Savings&Service Classifications'!F52","v":0},{"$f":"'Savings&Service Classifications'!F53","v":3},{"$f":"'Savings&Service Classifications'!F54","v":3},{"$f":"'Savings&Service Classifications'!F55","v":3},{"$f":"'Savings&Service Classifications'!F56","v":3},{"$f":"'Savings&Service Classifications'!F57","v":3},{"$f":"'Savings&Service Classifications'!F58","v":3},{"$f":"'Savings&Service Classifications'!F59","v":3},{"$f":"'Savings&Service Classifications'!F60","v":3},{"$f":"'Savings&Service Classifications'!F61","v":3},{"$f":"'Savings&Service Classifications'!F62","v":3},{"$f":"'Savings&Service Classifications'!F63","v":99},{"$f":"'Savings&Service Classifications'!F64","v":99},{"$f":"'Savings&Service Classifications'!F65","v":3},{"$f":"'Savings&Service Classifications'!F66","v":0},{"$f":"'Savings&Service Classifications'!F67","v":0},{"$f":"'Savings&Service Classifications'!F68","v":0},{"$f":"'Savings&Service Classifications'!F69","v":0},{"$f":"'Savings&Service Classifications'!F70","v":99},{"$f":"'Savings&Service Classifications'!F71","v":99},{"$f":"'Savings&Service Classifications'!F73","v":-1},{"$f":"'Savings&Service Classifications'!F74","v":2},{"$f":"'Savings&Service Classifications'!F75","v":0},{"$f":"'Savings&Service Classifications'!F76","v":99},{"$f":"'Savings&Service Classifications'!F77","v":99},{"$f":"'Savings&Service Classifications'!F78","v":99},{"$f":"'Savings&Service Classifications'!F79","v":99},{"$f":"'Savings&Service Classifications'!F80","v":100},{"$f":"'Savings&Service Classifications'!F81","v":100},{"$f":"'Savings&Service Classifications'!F82","v":100},{"$f":"'Savings&Service Classifications'!F83","v":100},{"$f":"'Savings&Service Classifications'!F84","v":100},{"$f":"'Savings&Service Classifications'!F85","v":100},{"$f":"'Savings&Service Classifications'!F86","v":100},{"$f":"'Savings&Service Classifications'!F87","v":100},{"$f":"'Savings&Service Classifications'!F88","v":100}]
["Aberdeen City",229840,20607,76923,62999,18690,6574,27,3546,5360,391,651,109,8481,2887,922,5116,574,60,43266,55007,6764,21718,4116,2069,4047,0,1727,3813,3393,363,267,337,0,0,151,221,0,72,1656,7078,14962,3016,-889,166,479,4050,-115,713,1335,1015,7424,63,0,164,926,0,0,2124,3291,1374,5706,1108,264,3263,91,-762,183,352,788,537,451,54,-15,0,0,4724,0,-8730,1236,-252,12971,3222,23073,397,167,0,{"$f":"SUM(C5:CI5)","v":458908},null,null,{"$f":"SUMIFS($C5:$CI5, $C$3:$CI$3, -2)","v":17413},{"$f":"SUMIFS($C5:$CI5, $C$3:$CI$3, -1)","v":23792},{"$f":"SUMIFS($C5:$CI5, $C$3:$CI$3, 0)","v":59413},{"$f":"SUMIFS($C5:$CI5, $C$3:$CI$3, 1)","v":68142},{"$f":"SUMIFS($C5:$CI5, $C$3:$CI$3, 2)","v":190334},{"$f":"SUMIFS($C5:$CI5, $C$3:$CI$3, 3)","v":60309},{"$f":"SUMIFS($C5:$CI5, $C$3:$CI$3, 99)","v":7421},{"$f":"SUMIFS($C5:$CI5, $C$3:$CI$3, 100)","v":32084},{"$f":"SUM(CM5:CT5)","v":458908},null,{"$f":"(CM5/$CU5)","v":3.7944424590549738E-2},5.1844814211127285E-2,0.12946603676553906,0.14848727849590768,0.41475415551700995,0.13141849782527218,1.6170997236918946E-2,6.9913795357675182E-2,null,{"$f":"SUMIFS($C5:$CI5,$C$4:$CI$4,-2)","v":17413},{"$f":"SUMIFS($C5:$CI5,$C$4:$CI$4,-1)","v":23792},{"$f":"SUMIFS($C5:$CI5,$C$4:$CI$4,0)","v":59413},{"$f":"SUMIFS($C5:$CI5,$C$4:$CI$4,1)","v":68142},{"$f":"SUMIFS($C5:$CI5,$C$4:$CI$4,2)","v":190334},{"$f":"SUMIFS($C5:$CI5,$C$4:$CI$4,3)","v":60309},{"$f":"SUMIFS($C5:$CI5,$C$4:$CI$4,99)","v":7421},{"$f":"SUMIFS($C5:$CI5,$C$4:$CI$4,100)","v":32084},{"$f":"SUM(DF5:DM5)","v":458908},null,{"$f":"DF5/$DN5","v":3.7944424590549738E-2},5.1844814211127285E-2,0.12946603676553906,0.14848727849590768,0.41475415551700995,0.13141849782527218,1.6170997236918946E-2,6.9913795357675182E-2]
["Aberdeenshire",262190,18408,106841,98497,33696,3373,60,1231,1154,0,400,354,5204,5430,2164,4489,1589.5668819188193,5,28762,62688.15822823182,3995.427270489638,32742.418833325628,4929.6910840079909,1803.3837241089268,549.00226054042696,0,4378,2331,2251,0,374,1750,-7,0,146,4113,4121,520,1148,7012,16137,2845,421,96,739,3611,125,1959,1068,2053,1561,0,454,486,746,233,219,3214,684,0,914,2115,259,2066,0,394,-105,364,1014,536,0,0,415,7735,0,1518,2201,0,2229,-50,11861,2759,23336,811,122,0,{"$f":"SUM(C6:CI6)","v":543647.64828262315},null,null,{"$f":"SUMIFS($C6:$CI6, $C$3:$CI$3, -2)","v":8903},{"$f":"SUMIFS($C6:$CI6, $C$3:$CI$3, -1)","v":24636},{"$f":"SUMIFS($C6:$CI6, $C$3:$CI$3, 0)","v":55099},{"$f":"SUMIFS($C6:$CI6, $C$3:$CI$3, 1)","v":103046},{"$f":"SUMIFS($C6:$CI6, $C$3:$CI$3, 2)","v":253093.64828262324},{"$f":"SUMIFS($C6:$CI6, $C$3:$CI$3, 3)","v":38303},{"$f":"SUMIFS($C6:$CI6, $C$3:$CI$3, 99)","v":19499},{"$f":"SUMIFS($C6:$CI6, $C$3:$CI$3, 100)","v":41068},{"$f":"SUM(CM6:CT6)","v":543647.64828262327},null,{"$f":"(CM6/$CU6)","v":1.6376415915942018E-2},{"$f":"(CN6/$CU6)","v":4.531611619736578E-2},{"$f":"(CO6/$CU6)","v":0.10135057177945515},{"$f":"(CP6/$CU6)","v":0.18954556379581727},{"$f":"(CQ6/$CU6)","v":0.46554721441754265},{"$f":"(CR6/$CU6)","v":7.0455560915233861E-2},{"$f":"(CS6/$CU6)","v":3.5866981236094955E-2},{"$f":"(CT6/$CU6)","v":7.5541575742548217E-2},null,{"$f":"SUMIFS($C6:$CI6,$C$4:$CI$4,-2)","v":8903},{"$f":"SUMIFS($C6:$CI6,$C$4:$CI$4,-1)","v":24636},{"$f":"SUMIFS($C6:$CI6,$C$4:$CI$4,0)","v":55099},{"$f":"SUMIFS($C6:$CI6,$C$4:$CI$4,1)","v":103046},{"$f":"SUMIFS($C6:$CI6,$C$4:$CI$4,2)","v":253093.64828262324},{"$f":"SUMIFS($C6:$CI6,$C$4:$CI$4,3)","v":38303},{"$f":"SUMIFS($C6:$CI6,$C$4:$CI$4,99)","v":19499},{"$f":"SUMIFS($C6:$CI6,$C$4:$CI$4,100)","v":41068},{"$f":"SUM(DF6:DM6)","v":543647.64828262327},null,1.6376415915942018E-2,4.531611619736578E-2,0.10135057177945515,0.18954556379581727,0.46554721441754265,7.0455560915233861E-2,3.5866981236094955E-2,7.5541575742548217E-2]
{"$rows_left_out":31}